*HEADING
RIGMASS55: TEST MASS PROPERTIES FOR C3D8, C3D6, B31, M3D4R, M3D3,
S4, S3R, R3D3, R3D4 AND T3D2 ELEMENTS INCLUDED IN A
RIGID BODY (APPLIED TORQUE)
*RESTART,WRITE,NUM=30
*NODE,NSET=NODES
*NSET,NSET=RFNODE
*NSET,NSET=QA_TEST
RFNODE,NODES
*ELEMENT, TYPE=MASS, ELSET=PTMASS
*ELEMENT, TYPE=C3D8, ELSET=BRICKS
*ELEMENT, TYPE=C3D6, ELSET=BRICKS
*ELEMENT, TYPE=B31, ELSET=BEAM
*ELEMENT, TYPE=T3D2, ELSET=TRUSS
*ELEMENT, TYPE=T3D2, ELSET=TRUSS1
*ELEMENT,TYPE=R3D4,ELSET=RIG1
*ELEMENT,TYPE=R3D3,ELSET=RIG2
*ELEMENT, TYPE=S4, ELSET=SHELL1
*ELEMENT, TYPE=S3R, ELSET=SHELL2
*ELEMENT, TYPE=M3D4R, ELSET=MEMBRANE
*ELEMENT, TYPE=M3D3, ELSET=MEMBRANE
*ELEMENT, TYPE=B31, ELSET=BEAM1
*ELEMENT, TYPE=B31, ELSET=BEAM2
*ELEMENT, TYPE=T3D2, ELSET=TRUSSD1
*ELEMENT, TYPE=T3D2, ELSET=TRUSSD2
*ELEMENT, TYPE=T3D2, ELSET=TRUSS2
*ELSET, ELSET=SHELL
SHELL1, SHELL2
*ELSET, ELSET=BEAM
BEAM1, BEAM2
*ELSET, ELSET=TRUSSD
TRUSSD1, TRUSSD2
*SOLID SECTION, ELSET=BRICKS, MATERIAL=MAT1
1.0,
*SOLID SECTION, ELSET=TRUSS, MATERIAL=MAT1
0.1,
*SOLID SECTION, ELSET=TRUSS1, MATERIAL=MAT1
0.1,
*BEAM SECTION,SECTION=CIRC,MATERIAL=MAT1,ELSET=BEAM
0.56419611,
*MATERIAL, NAME=MAT1
*ELASTIC
2.E+9, .3
*DENSITY
1.0,
*SHELL SECTION, ELSET=SHELL1, MATERIAL=MAT1
1.0,
*SHELL SECTION, ELSET=SHELL2, MATERIAL=MAT1
1.0,
*MEMBRANE SECTION, ELSET=MEMBRANE, MATERIAL=MAT1, POISSON=0.3
1.0,
*BEAM SECTION, SECTION= CIRC, ELSET=BEAM1, MATERIAL=MAT1
0.56419611,
*BEAM SECTION, SECTION= CIRC, ELSET=BEAM2, MATERIAL=MAT1
0.56419611,
*SOLID SECTION, ELSET=TRUSSD1, MATERIAL=MAT1
1.0,
*SOLID SECTION, ELSET=TRUSSD2, MATERIAL=MAT1
1.0,
*SOLID SECTION, ELSET=TRUSS2, MATERIAL=MAT1
0.1,
*MASS, ELSET=PTMASS
1.0,
*ELSET, ELSET=RIGID
BRICKS,BEAM,TRUSS1,RIG1,RIG2,SHELL, MEMBRANE, BEAM, TRUSSD
*RIGID BODY,ELSET=RIGID,REF NODE=100,POSITION=CENTER OF MASS,DENSITY=1.0
*BOUNDARY
100,1,2
304,1,2
*STEP
*DYNAMIC,EXPLICIT
,0.01
*CLOAD
100,6,1.E8
******************************************
*FILE OUTPUT, NUMBER INTERVAL = 1, TIMEMARKS=YES
*NODE FILE
U,
***********************************************
*OUTPUT, FIELD, NUMBER INTERVAL = 1, TIMEMARKS=YES
*NODE OUTPUT,NSET=QA_TEST
U,
*OUTPUT,HISTORY,TIME INTERVAL=0.01
*ENERGY OUTPUT, VAR=ALL
************************************
***OUTPUT,HISTORY,TIME INTERVAL=0.002
***NODE OUTPUT,NSET=RFNODE
**U,UR3
*END STEP