*HEADING
STANDARD RIGID BODY ISOTHERMAL / ALSO TESTS HEATCAP [C3D8T]
*PREPRINT,ECHO=YES,HISTORY=NO,MODEL=NO
*NODE,NSET=ALL
*ELEMENT,TYPE=C3D8T, ELSET=EALL
*SOLID SECTION,MATERIAL=A1, ELSET=EALL
*MATERIAL,NAME=A1
*ELASTIC
1.0,0.0
*CONDUCTIVITY
1.0,
*DENSITY
1.0,
*SPECIFIC HEAT
1.0,
*EXPANSION
0.0,
*NODE,NSET=REFNODE
*RIGID BODY,REF NODE=9999,ELSET=EALL,ISOTHERMAL=YES
*ELEMENT,TYPE=HEATCAP,ELSET=CAP
*HEATCAP,ELSET=CAP
*INITIAL CONDITIONS,TYPE=TEMPERATURE
9999,100
*BOUNDARY
9999,1,6
*STEP,INC=100
 COOL DOWN BY CONVECTION
*COUPLED TEMPERATURE-DISPLACEMENT,DELTMX=2.0
0.5,10.0
*FILM
1,F4,20,1.0
*EL FILE,FREQ=999
 TEMP,HFL,
*NODE FILE,FREQ=999
 NT,RFL
**
*OUTPUT, HISTORY,FREQ=1
*NODE OUTPUT, NSET=ALL
 NT,RFL
*NODE OUTPUT, NSET=REFNODE
NT,
*ELEMENT OUTPUT, ELSET=EALL
 TEMP,HFL,
**
*OUTPUT,FIELD,FREQ=9999
*ELEMENT OUTPUT, ELSET=EALL
 TEMP,HFL
*NODE OUTPUT, NSET=ALL
 NT,RFL,U
*NODE OUTPUT, NSET=REFNODE
NT,
*ENDSTEP
*****************************************
*STEP,INC=100
HEATED UP BY PRESCRIBED FLUX
*COUPLED TEMPERATURE-DISPLACEMENT,deltmx=50
0.05,10.0
*FILM,OP=NEW
1,F2,20,0.0
*DFLUX,OP=NEW
1,S1,24,1.0
*ENDSTEP