*HEADING
 Raasch Challenge Problem, S4R elements.
 20 x 144 mesh
*RESTART,WRITE,FREQ=10
*NODE
*NODE
*NGEN,LINE=C,NSET=R14-B
*NGEN,LINE=C,NSET=R14-T
*NGEN,LINE=C,NSET=R46-B
*NGEN,LINE=C,NSET=R46-T
*NSET,NSET=BOT
 R14-B, R46-B
*NSET,NSET=TOP
 R14-T, R46-T
*NFILL,NSET=NALL
 BOT, TOP, 20, 1000
*NSET,NSET=WALL,GEN
*ELEMENT,TYPE=S4R
*ELGEN,ELSET=EALL
*SHELL SECTION,MATERIAL=A1,ELSET=EALL
 2.,3
*MATERIAL,NAME=A1
*ELASTIC
 3300, 0.35
*BOUNDARY
 WALL,1,6
*NSET,NSET=TIP
*NSET,NSET=NREF
*ELSET, ELSET=EDGE
*SURFACE, NAME=EDGE
 EDGE,E2
*COUPLING, CONSTRAINT NAME=TIPLOAD, REF NODE=NREF, SURFACE=EDGE
*DISTRIBUTING
*STEP,PERT
*STATIC
*CLOAD
100001,3,1.0
*NODE PRINT, NSET=TIP
 U,
*NODE FILE, NSET=TIP
 U,
*OUTPUT,FIELD
*NODE OUTPUT,NSET=TIP
U,
** *EL FILE, ELSET=TIPLOAD
** NFORC,
** *OUTPUT,FIELD
** *ELEMENT OUTPUT,ELSET=TIPLOAD
** NFORC,
*ENDSTEP