*HEADING
 SUBSTRUCTURE GENERATION FILE USED BY psupshl2or.inp
**
*NODE
*NGEN,NSET=A
*NGEN,NSET=B
*NSET,NSET=PRN-SUPER
A,B
*NFILL
A,B, 10, 20
*ELEMENT,TYPE=S4R
*ELGEN,ELSET=SHELL_ELEMENT
*ELSET,ELSET=PRE-SUPER
*SHELL GENERAL SECTION,ELSET=SHELL_ELEMENT,MATERIAL=MATERIAL_1,
ORIENTATION=ZERO_ORIENTATION
1.0,
*MATERIAL,NAME=MATERIAL_1
*ELASTIC
2.1E11, 0.3
*ORIENTATION,NAME=ZERO_ORIENTATION
**
**
*STEP
*SUBSTRUCTURE GENERATE,TYPE=Z1,OVERWRITE
*RETAINED NODAL DOFS
*SUBSTRUCTURE LOAD CASE,NAME=S1
*CLOAD
201 , 2, -50.
203 , 2,-100.
205 , 2, -50.
*END STEP