*HEADING
 CROSS SECTION FOR CIRCULAR DISK
 REFERENCE FILE FOR:     pstc36shhrs
*RESTART,WRITE,FREQ=100
*NODE,NSET=NODES_TIRE
*NGEN,NSET=NODES_SIDE-1
*NGEN,NSET=NODES_SIDE-2
*NSET,NSET=NODES_TIRE
 NODES_SIDE-1,NODES_SIDE-2
*NSET,NSET=NODES_RIM
*NSET,NSET=NODES_TREAD
*ELEMENT,TYPE=CAX3H,ELSET=ELEMENTS_TIRE
*ELGEN,ELSET=ELEMENTS_TIRE
*ELSET,ELSET=ELEMENTS_RIM
*ELSET,ELSET=ELEMENTS_TREAD
*SOLID SECTION,MATERIAL=HYPER,ELSET=ELEMENTS_TIRE
*MATERIAL,NAME=HYPER
*HYPERELASTIC,MOD=L
 80.0, 20.0
*VISCOELASTIC,TIME=PRONY
 0.2, 0.0, 0.1
*DENSITY
 0.036,
*****
*STEP,INC=100,NLGEOM
 DO NOTHING
*STATIC,LONG TERM
*BOUNDARY
 101, 2
*NODE PRINT,FREQ=0
*EL PRINT,FREQ=0
*NODE FILE,NSET=NODES_RIM
 U, RF
*ELFILE,ELSET=ELEMENTS_TREAD
 S,
*END STEP