*HEADING
: Submodel from pgs33dfh [DS3]
*NODE
*NGEN,NSET=NL
*NGEN,NSET=NR
*NFILL,NSET=NALL
NL,NR,4,5
*NSET,NSET=NT
*ELEMENT,TYPE=DS3,ELSET=EALL
*ELGEN,ELSET=EALL
*SHELL SECTION,ELSET=EALL,MATERIAL=MAT1
0.001,3
*MATERIAL,NAME=MAT1
*ELASTIC
1.E6,0.3
*EXPANSION
1.E-6,
*CONDUCTIVITY
4.85E-4,
*DENSITY
0.283,
*SPECIFIC HEAT
0.116,
*SUBMODEL
NL,NT,
*NSET,NSET=ND
*STEP
*HEAT TRANSFER,STEADY STATE
1.,1.
*BOUNDARY
ND,11,11,0.
ND,13,13,100.
*BOUNDARY,SUBMODEL,STEP=1
NL,11,13
NT,11,13
*NODE PRINT
NT,
*NODE FILE
NT,
*END STEP