*HEADING
: Submodel from pgce4shm [CPE4]
*RESTART,WRITE
*NODE
*NGEN,NSET=NL
*NGEN,NSET=NR
*NFILL,NSET=NALL
NL,NR,6,100
*ELEMENT,TYPE=CPE4,ELSET=EALL
*ELGEN,ELSET=EALL
*ELSET,ELSET=E1
*SOLID SECTION,MATERIAL=MAT1,ELSET=EALL
1.,
*MATERIAL,NAME=MAT1
*ELASTIC
30.E6,0.3
*EXPANSION
1.E-6,
*DENSITY
100.,
*CONDUCTIVITY
 3.77E-5,
*SPECIFIC HEAT
 .39,
*ELSET,ELSET=LOAD
*STEP
*STATIC
0.1,1.0
*BOUNDARY
NL,1,2
*TEMPERATURE, FILE=pgce4shm_inter.odb, interpolate
*DLOAD,OP=NEW
LOAD,P2,-1000000.
*ENERGY FILE
*EL FILE,ELSET=E1,FREQ=999
 S,E,
*NODE FILE
 U,RF
*EL PRINT
 S,COORD,
 E,
*NODE PRINT
 U,COORD,
NT
*END STEP
*STEP
*STATIC
*TEMPERATURE,OP=NEW
*DLOAD,OP=NEW
*NODE PRINT
NT
*END STEP