*HEADING
: Submodel from pgce4shm [CPE4]
*NODE
*NGEN,NSET=NL
*NGEN,NSET=NR
*NFILL,NSET=NALL
NL,NR,6,100
*ELEMENT,TYPE=CPE4,ELSET=EALL
*ELGEN,ELSET=EALL
*ELSET,ELSET=E1
*SOLID SECTION,MATERIAL=MAT1,ELSET=EALL
1.,
*MATERIAL,NAME=MAT1
*ELASTIC
30.E6,0.3
*ELSET,ELSET=LOAD
*SUBMODEL,EXT=0.05,ABS=0.15
NL,NR,
*STEP,PERTURBATION
*STATIC
*BOUNDARY,SUBMODEL,STEP=2,INC=2
NL,1,2
*DLOAD,OP=NEW
LOAD,P2,-1000000.
*ENERGY FILE
*EL FILE,ELSET=E1,FREQ=999
 S,E,
*NODE FILE
 U,RF
*EL PRINT
 S,COORD,
 E,
*NODE PRINT
 U,COORD
*END STEP