*HEADING
Submodel analysis: 4 x 4 mesh with cax6mht.     File name:
*NODE,NSET=ALL
*NGEN,NSET=NL
*NGEN,NSET=NR
*NFILL,NSET=ALL
NL,NR,8,10
*NSET,NSET=FIX1,GEN
**1,81,10
*NSET,NSET=FIX2,GEN
*NSET,NSET=FIX3,GEN
*NSET,NSET=FIX4,GEN
*NSET,NSET=NALL
FIX1,FIX2,FIX3,FIX4
*SUBMODEL
NALL,
*ELEMENT, TYPE=CAX6MHT, ELSET=EALL
*ELGEN,ELSET=EALL
*ELSET,ELSET=EFLUX2
*SOLID SECTION,MATERIAL=A1, ELSET=EALL
*MATERIAL,NAME=A1
*ELASTIC
 30.E6, .3
*EXPANSION
 1.E-5,
*CONDUCTIVITY
 3.77E-5,
*SPECIFIC HEAT
 .39,
*DENSITY
 82.9,
*RESTART,WRITE
*STEP
*COUPLED TEMPERATURE-DISPLACEMENT, STEADY STATE
 .000001, .000001
*BOUNDARY
FIX1, 2
*BOUNDARY,SUBMODEL,STEP=1
FIX3,1,2
FIX3,11,11
FIX4,1,2
FIX4,11,11
*DFLUX
EFLUX2,S2,0.3
*ENERGY FILE
*EL FILE
 E,S
 LOADS,FLUXS
 FILM,RAD
*NODE FILE
 U ,
 RF,
 NT,
 RFL,
*EL PRINT
 E,S
 LOADS,FLUXS
 FILM,RAD
*NODE PRINT
 U,
 RF,
 NT,
 RFL,
*END STEP