*HEADING
 , Submodelling test: sub model from pgc3msfs [C3D10M]
*RESTART,WRITE
*NODE
**
**
*ELEMENT, TYPE=C3D10, ELSET=EALL
**
** eall
**
*SOLID SECTION, ELSET=EALL, MATERIAL=STEEL
          1.,
*MATERIAL, NAME=STEEL
**
*DENSITY
         10.,
**
*ELASTIC, TYPE=ISO
       3.E+7,         0.3
*****
*NSET,NSET=NSUB
*SURFACE,NAME=SEND
      18, S1
      19, S1
      38, S1
      39, S1
      58, S1
      59, S1
      78, S1
      79, S1
      98, S1
      99, S1
     118, S1
     119, S1
*SUBMODEL,TYPE=SURFACE
SEND,
*SUBMODEL
NSUB,
**
*STEP,PERTURBATION
*STATIC
*dsload,SUBMODEL,STEP=1
SEND,
*BOUNDARY,SUBMODEL,STEP=1
NSUB,1,3
*EL FILE
S,E
*NODE FILE
U,
*END STEP