*HEADING
- SHELL-TO-SOLID SUBMODEL FROM pgs63srsf [C3D8I]
**
*RESTART,WRITE
*NODE
**
**
*ELEMENT, TYPE=C3D8I, ELSET=EALL
*NSET,NSET=NL,GENERATE
*ELSET,ELSET=ELOAD,GENERATE
*ELSET,ELSET=END,GENERATE
*SOLID SECTION,ELSET=EALL,MATERIAL=MAT1
*MATERIAL,NAME=MAT1
*ELASTIC
1.E6,0.3
*DENSITY
1.0,
*SUBMODEL,ABS=0.01,SHELL TO SOLID,SHELL THICKNESS=0.1
NL,
**
** STEP 1 - NON-LINEAR STATIC STEP
**
*STEP,NLGEOM
*STATIC
0.25,1.
*DLOAD, OP=NEW
   ELOAD,P2,-1.E-2
*BOUNDARY,SUBMODEL,STEP=1
NL,0.0005
*EL PRINT,FREQ=999,POSITION=INTEGRATION POINTS,ELSET=END
SINV,
*NODE FILE,FREQ=999,NSET=NL
U,
*NODE PRINT,FREQ=999,NSET=NL
U,
RF,
*END STEP