*HEADING
: SUBMODEL [C3D8I]
GLOBAL MODEL ELEMENT TYPE: S4R
GLOBAL MODEL FILE NAME: PGSF4SRSC
*NODE
*ELEMENT, TYPE=C3D8I, ELSET=EALL
*ELSET,ELSET=END1
*NSET, NSET=DRIVE
*NSET,NSET=END
*NSET,NSET=DRIVE1
*SOLID SECTION, ELSET=EALL, MATERIAL=MALL
          1.,
*MATERIAL, NAME=MALL
*ELASTIC, TYPE=ISO
       1.E+7,         0.3
*DENSITY
0.001,
*SUBMODEL,SHELLTOSOLID,ABSOLUTE EXTERIOR TOLERANCE=0.02,SHELL THICKNESS=0.2
DRIVE,
*ELSET,ELSET=DL1,GENERATE
*STEP,NLGEOM,INC=100
*STATIC
0.25,1.
*DLOAD, OP=NEW
DL1,P2,10.
*BOUNDARY, OP=NEW,STEP=1,INC=1,SUBMODEL
DRIVE,0.02
*NODE PRINT,NSET=DRIVE1,FREQ=999
U,
*NODE PRINT,NSET=END,FREQ=999
U,
*NODE FILE,NSET=DRIVE1,FREQ=999
U,
*NODE FILE,NSET=END,FREQ=999
U,
*EL PRINT, POSITION=INTEGRATION POINT,ELSET=END1,FREQ=999
SINV,
*END STEP