*HEADING
: Submodel from pgc34sfs [C3D8]
*NODE
*NSET,NSET=NLOADED
*NSET,NSET=NL
*SUBMODEL,EXT=0.001
NLOADED
*SUBMODEL, TYPE=SURFACE,EXT=0.01
submodel_driven_surf,
*ELEMENT,TYPE=C3D8,ELSET=EALL
*ELSET,ELSET=EF
*ELSET,ELSET=NLELESET
*ELSET,ELSET=LOAD
*Surface, name=submodel_driven_surf
NLELESET, S6
*SOLID SECTION,ELSET=EALL,MATERIAL=MAT1
*MATERIAL,NAME=MAT1
*ELASTIC
30.E6,0.3
*STEP,PERTURBATION
*STATIC
*BOUNDARY,SUBMODEL,STEP=1
NLOADED,1,3
*DSLOAD, submodel, OP=NEW, STEP=1
submodel_driven_surf
*ENERGY FILE
*EL FILE,ELSET=EF
S,E,
*NODE FILE
U,RF,
*EL PRINT,ELSET=EF
S,
E,
*NODE PRINT
U,COORD,
*END STEP