*HEADING
 A Penny-Shaped Crack under Concentrated Forces
 b/a=0.66, P=R=400 MN
 File name: .inp
**
*NODE,INPUT=ppennycrack_node.inp
*ELEMENT,TYPE=C3D8,INPUT=ppennycrack_element.inp
*NSET, NSET=load_pu
*NSET, NSET=load_pb
*NSET, NSET=remfixu
*NSET, NSET=remfixb
*NSET, NSET=crack_1
*NSET, NSET=crack_2
*NSET, NSET=crack_3
*NSET, NSET=crack_4
*NSET, NSET=crack_5
*NSET, NSET=crack_6
*NSET, NSET=crack_7
*NSET, NSET=crack_8
*NSET, NSET=crack_9
*NSET, NSET=crack_10
*NSET, NSET=crack_11
*NSET, NSET=crack_12
*NSET, NSET=crack_13
*NSET, NSET=crack_14
*NSET, NSET=crack_15
*NSET, NSET=crack_16
*NSET, NSET=crack_17
*NSET, NSET=crack_18
*NSET, NSET=crack_19
*NSET, NSET=crack_20
** ... 11 like lines cut
*ELSET, ELSET=ALL, GENERATE
*BOUNDARY
remfixu,1,3
remfixb,1,3
**bottom, ENCASTRE
*SOLID SECTION, MATERIAL=ELSOLID, ELSET=ALL
*MATERIAL, NAME=ELSOLID
*ELASTIC
200.0E11, 0.3
*STEP
*STATIC
*CLOAD
load_pu,1,400.0E6
load_pu,3,400.0E6
*NODE PRINT, NSET=load_pu
U,
*EL FILE,freq=0
S, ENER
*NODE FILE,nset=load_pu
U, COORD
*OUTPUT,FIELD
*NODE OUTPUT,nset=load_pu
U, COORD
*CONTOUR INTEGRAL, CONTOURS=5,OUTPUT=BOTH
crack_1,    1.0000000000,    0.0000000000,    0.0000000000
crack_2,    0.9781476007,    0.2079116908,    0.0000000000
crack_3,    0.9135454576,    0.4067366431,    0.0000000000
crack_4,    0.8090169944,    0.5877852523,    0.0000000000
crack_5,    0.6691306064,    0.7431448255,    0.0000000000
crack_6,    0.5000000000,    0.8660254038,    0.0000000000
crack_7,    0.3090169944,    0.9510565163,    0.0000000000
crack_8,    0.1045284633,    0.9945218954,    0.0000000000
crack_9,   -0.1045284633,    0.9945218954,    0.0000000000
crack_10,  -0.3090169944,    0.9510565163,    0.0000000000
crack_11,  -0.5000000000,    0.8660254038,    0.0000000000
crack_12,  -0.6691306064,    0.7431448255,    0.0000000000
crack_13,  -0.8090169944,    0.5877852523,    0.0000000000
crack_14,  -0.9135454576,    0.4067366431,    0.0000000000
crack_15,  -0.9781476007,    0.2079116908,    0.0000000000
crack_16,  -1.0000000000,    0.0000000000,    0.0000000000
crack_17,  -0.9781476007,   -0.2079116908,    0.0000000000
crack_18,  -0.9135454576,   -0.4067366431,    0.0000000000
crack_19,  -0.8090169944,   -0.5877852523,    0.0000000000
crack_20,  -0.6691306064,   -0.7431448255,    0.0000000000
** ... 11 like lines cut
*CONTOUR INTEGRAL, CONTOURS=5,OUTPUT=BOTH,TYPE=K FACTORS
crack_1,    1.0000000000,    0.0000000000,    0.0000000000
crack_2,    0.9781476007,    0.2079116908,    0.0000000000
crack_3,    0.9135454576,    0.4067366431,    0.0000000000
crack_4,    0.8090169944,    0.5877852523,    0.0000000000
crack_5,    0.6691306064,    0.7431448255,    0.0000000000
crack_6,    0.5000000000,    0.8660254038,    0.0000000000
crack_7,    0.3090169944,    0.9510565163,    0.0000000000
crack_8,    0.1045284633,    0.9945218954,    0.0000000000
crack_9,   -0.1045284633,    0.9945218954,    0.0000000000
crack_10,  -0.3090169944,    0.9510565163,    0.0000000000
crack_11,  -0.5000000000,    0.8660254038,    0.0000000000
crack_12,  -0.6691306064,    0.7431448255,    0.0000000000
crack_13,  -0.8090169944,    0.5877852523,    0.0000000000
crack_14,  -0.9135454576,    0.4067366431,    0.0000000000
crack_15,  -0.9781476007,    0.2079116908,    0.0000000000
crack_16,  -1.0000000000,    0.0000000000,    0.0000000000
crack_17,  -0.9781476007,   -0.2079116908,    0.0000000000
crack_18,  -0.9135454576,   -0.4067366431,    0.0000000000
crack_19,  -0.8090169944,   -0.5877852523,    0.0000000000
crack_20,  -0.6691306064,   -0.7431448255,    0.0000000000
** ... 11 like lines cut
*CONTOUR INTEGRAL, CONTOURS=5,OUTPUT=BOTH,TYPE=T-STRESS
crack_1,    1.0000000000,    0.0000000000,    0.0000000000
crack_2,    0.9781476007,    0.2079116908,    0.0000000000
crack_3,    0.9135454576,    0.4067366431,    0.0000000000
crack_4,    0.8090169944,    0.5877852523,    0.0000000000
crack_5,    0.6691306064,    0.7431448255,    0.0000000000
crack_6,    0.5000000000,    0.8660254038,    0.0000000000
crack_7,    0.3090169944,    0.9510565163,    0.0000000000
crack_8,    0.1045284633,    0.9945218954,    0.0000000000
crack_9,   -0.1045284633,    0.9945218954,    0.0000000000
crack_10,  -0.3090169944,    0.9510565163,    0.0000000000
crack_11,  -0.5000000000,    0.8660254038,    0.0000000000
crack_12,  -0.6691306064,    0.7431448255,    0.0000000000
crack_13,  -0.8090169944,    0.5877852523,    0.0000000000
crack_14,  -0.9135454576,    0.4067366431,    0.0000000000
crack_15,  -0.9781476007,    0.2079116908,    0.0000000000
crack_16,  -1.0000000000,    0.0000000000,    0.0000000000
crack_17,  -0.9781476007,   -0.2079116908,    0.0000000000
crack_18,  -0.9135454576,   -0.4067366431,    0.0000000000
crack_19,  -0.8090169944,   -0.5877852523,    0.0000000000
crack_20,  -0.6691306064,   -0.7431448255,    0.0000000000
** ... 11 like lines cut
*END STEP