** : base problem for symmetric transfer problem: pm3dsfpln2
*heading
 FEATURES TESTED: *SYMMETRIC MODEL GENERATION, REFLECT=PLANE
 **               *SYMMETRIC RESULTS TRANSFER
 ELEMENT TESTED: M3D8
*node,nset=nall
*element,type=m3d8,elset=eall
*nset,nset=npull
*nset,nset=nsymm
*nset,nset=n2
*nset,nset=n1
*nset,nset=n5
*nset,nset=n3
*nset,nset=n4
*membrane section, elset=eall, material=mall
0.1,5
*REBAR LAYER
REBAR1,0.1,0.2,0,STIFF,45,1
REBAR2,0.1,0.2,0,STIFF,-45,1
*material, name=mall
*elastic
1.e4,0.3
*material,name=stiff
*elastic
1.e6,
*rest,w
*step,nlgeom
*static
*boundary
nsymm,xsymm
npull,1,1,-0.1
n1,2,3
n2,2,3
n5,2,3
*nodefile
u,
*elfile
s,
e,
*elfile,rebar
s,
e,
*nodeprint
u,
*elprint
s,
e,
*elprint,rebar
s,
e,
*endstep