*HEADING
 PINCHED SPHERE  ( 5 SAX2 )
*NODE
*NGEN,LINE=C
*ELEMENT,TYPE=SAX2,ELSET=BALL
*ELGEN,ELSET=BALL
*SHELL SECTION,ELSET=BALL,MATERIAL=BALLMT
 .4,3
*MATERIAL,NAME=BALLMT
*ELASTIC
 10.E6,.3
*BOUNDARY
 1,2
 1,6
 11,1
 11,6
*STEP
*STATIC
*CLOAD
 11,2,10.
*ENERGY PRINT
*EL PRINT
S,
SF,
E,
SE,
*ENERGY FILE
*OUTPUT,HISTORY,FREQUENCY=1
*ENERGY OUTPUT,VARIABLE=PRESELECT
*EL FILE,ELSET=BALL
S,
SF,
E,
SE,
*OUTPUT,FIELD
*ELEMENT OUTPUT,ELSET=BALL
S,
SF,
E,
SE,
*EL PRINT,POSITION=AVERAGED AT NODES
S,E
*NODE FILE
U,
CF,
RF,
*OUTPUT,FIELD
*NODE OUTPUT
U,
CF,
RF,
*END STEP