*HEADING
: Cantilevered plate [S4R]
*NODE
*NGEN,NSET=NL
*NGEN,NSET=NR
*NFILL,NSET=NALL
NL,NR,6,5
*ELEMENT,TYPE=S4R,ELSET=EALL
*ELGEN,ELSET=EALL
*ELSET,ELSET=E1
*SHELL SECTION,ELSET=EALL,MATERIAL=MAT1
0.001,
*MATERIAL,NAME=MAT1
*ELASTIC
1.E6,0.3
*BOUNDARY
NL,1,6
*STEP
*STATIC
0.5,1.
*DLOAD
EALL,P,1.E-7
*EL FILE,ELSET=E1,FREQ=999
S,E,
*NODE FILE,FREQ=1
U,
*NODE PRINT,NSET=NR,SUMM=NO
U,
*END STEP