*HEADING
Global analysis: 3 x 3 mesh with c3d20rht.     File name:
*NODE,NSET=ALL
*NGEN,NSET=NL1
*NGEN,NSET=NR1
*NFILL,NSET=ALL1
NL1,NR1,6,10
*NGEN,NSET=NL2
*NGEN,NSET=NR2
*NFILL,NSET=ALL2
NL2,NR2,6,10
*NGEN,NSET=NL3
*NGEN,NSET=NR3
*NFILL,NSET=ALL3
NL3,NR3,6,10
*NSET,NSET=FIX1,GEN
*NSET,NSET=FIX2,GEN
*NSET,NSET=FIX3,GEN
*NSET,NSET=FIX4,GEN
*NSET,NSET=ALL
ALL1,ALL2,ALL3
*NSET,NSET=NALL
FIX1,FIX2,FIX3,FIX4
*ELEMENT, TYPE=C3D20RHT, ELSET=EALL
*ELGEN,ELSET=EALL
*ELSET,ELSET=EFLUX2
*SOLID SECTION,MATERIAL=A1, ELSET=EALL
*MATERIAL,NAME=A1
*ELASTIC
 30.E6, .3
*EXPANSION
 1.E-5,
*CONDUCTIVITY
 3.77E-5,
*SPECIFIC HEAT
 .39,
*DENSITY
 82.9,
*RESTART,WRITE
*STEP
*COUPLED TEMPERATURE-DISPLACEMENT, STEADY STATE
 .000001, .000001
*BOUNDARY, OP=NEW
 ALL1,  3
 ALL3,  3
 FIX1,  2
 FIX4,  1
 FIX4, 11
*DFLUX,OP=NEW
 EFLUX2, S4, .3
*ENERGY FILE
*OUTPUT,HISTORY,FREQUENCY=1
*ENERGY OUTPUT,VARIABLE=PRESELECT
*EL FILE
 LOADS,FLUXS
 FILM,RAD
*NODE FILE
 U,
 RF,
 NT,
 RFL,
*OUTPUT,FIELD
*NODE OUTPUT
U,
RF,
NT,
RFL,
*EL PRINT
 LOADS,FLUXS
 FILM,RAD
*NODE PRINT
 U,
 RF,
 NT,
 RFL,
*END STEP