*HEADING
:  PATCH TEST FOR HEAT TRANSFER ELEMENTS [DC3D8]
*NODE
*NSET,NSET=SIDES
*ELEMENT,TYPE=DC3D8, ELSET=EALL
*SOLID SECTION,MATERIAL=A1, ELSET=EALL
*MATERIAL,NAME=A1
*CONDUCTIVITY
4.85E-4,
*DENSITY
0.283,
*SPECIFIC HEAT
0.116,
**
**
*STEP
 STEADY STATE
*HEAT TRANSFER,STEADY STATE
*BOUNDARY
 10,11, ,0.
 20,11, ,0.
120,11, ,0.
110,11, ,0.
 12,11, ,1000.
 22,11, ,1000.
320,11, ,1000.
420,11, ,1000.
*EL PRINT
 HFL,
*NODE FILE
NT,
*OUTPUT,FIELD
*NODE OUTPUT
 NT,
*OUTPUT,FIELD
*ELEMENT OUTPUT
 HFL,
*OUTPUT,FIELD
*ELEMENT OUTPUT,POSITION=CENTROID
 HFL,
*ENDSTEP