*HEADING
CRACK PROPAGATION ALONG AN INTERFACE VIA CRITICAL STRESS CRITERION
** Centre crack specimen: symmetry conditions taken into account.
*RESTART,WRITE,FREQ=1
*NODE
*NGEN, NSET=BOT
*NGEN,NSET=TOP
*NFILL
BOT,TOP,4,50
*ELEMENT,TYPE=CPE4
*ELGEN,ELSET=SOLID
*SOLID SECTION,ELSET=SOLID,MAT=ELASTIC
1.,
*MATERIAL,NAME=ELASTIC
*ELASTIC
1.E6,.3
**
*** Contact definitions.
**
*rigid body,analytical surface=ASURF, REF NODE=999
*surface,TYPE=SEGMENTS,NAME=ASURF
START,-1.0, 0.0
LINE, 25.1, 0.0
**
*** Contact definitions.
**
*ELSET, ELSET=BOT, GEN
*ELSET, ELSET=TOP, GEN
*surface, NAME=BSURF
BOT, S1
*SURFACE INTERACTION, NAME=BOTH
1.0,
*CONTACT PAIR,INTERACTION=BOTH,SMALL SLIDING
BSURF, ASURF
**
** Nodeset definitions for bonding
*NSET,NSET=BOND,GEN
*INITIAL CONDITIONS,TYPE=CONTACT, NORMAL
BSURF,ASURF,BOND
*BOUNDARY
1, 2
25, 2
213, 1
999, 1, 2
999, 6
**
*** step definitions
**
*STEP,INC=20
*STATIC
8.0E-04, 0.001313
*DEBOND,SLAVE=BSURF,MASTER=ASURF,TIME INC=1.E-04
*FRACTURE CRITERION,TYPE=CRITICAL STRESS,TOLERANCE=0.01,DISTANCE=0.0
*BOUNDARY
TOP, 2, 2, 0.2363
*ENERGY PRINT
*CONTACT PRINT
CSTRESS,CDISP
DBT,DBSF,DBS
*EL PRINT,ELSET=SOLID
S, E
*OUTPUT,FIELD
*CONTACT OUTPUT, VARIABLE=ALL
CSTRESS,CDISP
*OUTPUT,FIELD
*ELEMENT OUTPUT
S, E
*END STEP
**
***  step 2:
**
*STEP,INC=20
*STATIC
1.0E-04, 0.001187
*DEBOND,SLAVE=BSURF,MASTER=ASURF,TIME INC=1.E-04
*FRACTURE CRITERION,TYPE=CRITICAL STRESS,TOLERANCE=0.01,DISTANCE=0.0
*BOUNDARY
TOP, 2, 2, 0.45
*END STEP