*Heading
*Preprint, model=yes, echo=yes, history=yes
*Restart, write, frequency=100
** ---------------------------------------------
** PART INSTANCE: PART-1-1
**
*Node
*Element, type=CGAX4RH, elset=hostsolid2d
*Elset, elset=ASSEMBLY_PART-1-1__I1
*solidsection, elset=ASSEMBLY_PART-1-1__I1, material=rubber,controls=hgc
*section controls,name=hgc,hourglass=stiffness
*Rebar, element=continuum, material=steel,geometry=skew, name=rebar1
*Rebar, element=continuum, material=steel,geometry=skew, name=rebar2
*Rebar, element=continuum, material=steel,geometry=skew, name=rebar3
*Rebar, element=continuum, material=steel,geometry=skew, name=rebar4
*Rebar, element=continuum, material=steel,geometry=skew, name=rebar5
*Rebar, element=continuum, material=steel,geometry=skew, name=rebar6
*Rebar, element=continuum, material=steel,geometry=skew, name=rebar7
*Rebar, element=continuum, material=steel,geometry=skew, name=rebar8
*Rebar, element=continuum, material=steel,geometry=skew, name=rebar9
*Rebar, element=continuum, material=steel,geometry=skew, name=rebar10
*Rebar, element=continuum, material=steel,geometry=skew, name=rebar11
*Rebar, element=continuum, material=steel,geometry=skew, name=rebar12
*Rebar, element=continuum, material=steel,geometry=skew, name=rebar13
*Material, name=steel
*Elastic
2.0e11, 0.3
** ----------------------------------------------------------------
** PART INSTANCE: PART-2-1
**
*Node
*Nset, nset=ASSEMBLY_PART-2-1_PART-2-1-REFPT_
*surface, type=SEGMENTS, name=ASSEMBLY_PART-2-1_RIGIDSURFACE_
START, 0.223558, 0.196184
CIRCL, 0.0484494, 0.129181, 0.123184, 0.196184
line, 0.0484494,  0.030819
circl, 0.223558, -0.036184,  0.123184, -0.036184
*rigidbody, refnode=ASSEMBLY_PART-2-1_PART-2-1-REFPT_, analyticalsurface=ASSEMBLY_PART-2-1_RIGIDSURFACE_
*surface, type=ELEMENT, name=ASSEMBLY__G23
ASSEMBLY___G23_S4, S4
ASSEMBLY___G23_S2, S2
ASSEMBLY___G23_S1, S1
**
** Assembly Nsets
**
*Nset, nset=ASSEMBLY__G24
*Nset, nset=ASSEMBLY__G26
**
** Assembly Elsets
**
*Elset, elset=ASSEMBLY__G24
*Elset, elset=ASSEMBLY___G23_S1
*Elset, elset=ASSEMBLY___G23_S2
*Elset, elset=ASSEMBLY___G23_S4
*material, name=rubber
*hyperelastic
2.0E+6, 1.5E+06, 0.
*surfaceinteraction, name=INTPROP-1
*friction, elastic slip=0.005
0.1,
*surfacebehavior, pressure-overclosure=HARD
*contactpair, interaction=INTPROP-1
ASSEMBLY__G23, ASSEMBLY_PART-2-1_RIGIDSURFACE_
*Step, name=Step-1, nlgeom
compress
*static
0.01, 1., 1E-05,0.05
*boundary
ASSEMBLY__G24, 2,2
ASSEMBLY__G24, 5,5
*boundary
ASSEMBLY__G26, 1, 1
ASSEMBLY__G26, 2, 2, -0.08
ASSEMBLY__G26, 6, 6
*restart, write, frequency=1
*nset, nset=hax
*elset, elset=hax
*output, history, freq=5
*node output, nset=hax
u
*element output, elset=hax
s,le
*output, field, frequency=9999
*element output, elset=hax
s,le
*node output
u
*el file, frequency=9999, elset=hax
s,le
*node file, frequency=9999, nset=hax
u
*endstep