*HEADING
TEST FOR OVERCONSTRAINTS--
TIE CONSTRAINTS INSIDE A RIGID BODY MADE FROM MISC. ELEMENTS
*PREPRINT, ECHO=YES, MODEL=YES, HISTORY=YES
*NODE,NSET=NALL
*ELEMENT,TYPE=S8R,ELSET=ESHL1
*ELEMENT,TYPE=S4,ELSET=ESHL2
*ELEMENT,TYPE=S3,ELSET=ESHL3
*ELEMENT,TYPE=M3D3,ELSET=EMBR1
*ELEMENT,TYPE=M3D8,ELSET=EMBR2
*ELEMENT,TYPE=C3D8,ELSET=ESLD
*ELSET,ELSET=ESHL
ESHL1,ESHL2,ESHL3
*ELSET,ELSET=EMBR
EMBR1,EMBR2
*ELSET,ELSET=EALL
ESHL,EMBR,ESLD
*SOLID SECTION,MATERIAL=MAT,ELSET=ESLD
*SHELL SECTION,MATERIAL=MAT,ELSET=ESHL
0.1
*MEMBRANE SECTION,MATERIAL=MAT,ELSET=EMBR
0.1
*MATERIAL,NAME=MAT
*ELASTIC
1.e5,0.3
*DENSITY
1.E3
*SURFACE,NAME=SURF1
ESHL1,SPOS
*SURFACE,NAME=SURF2
ESHL2,SPOS
*SURFACE,NAME=SURF3
ESHL3,SPOS
*SURFACE,NAME=SURF4
EMBR1,SPOS
*SURFACE,NAME=SURF5
EMBR2,SPOS
*SURFACE,NAME=SURF6
ESLD,S1
***CONSTRAINT CONTROLS,NO CHANGES
*TIE,NAME=TIE1,ADJUST=NO,POSITION=0.1
SURF1,SURF2
*TIE,NAME=TIE2,ADJUST=NO,POSITION=0.1
SURF3,SURF4
*TIE,NAME=TIE3,ADJUST=NO,POSITION=0.1
SURF4,SURF5
*TIE,NAME=TIE4,ADJUST=NO,POSITION=0.1
SURF2,SURF5
*TIE,NAME=TIE5,ADJUST=NO,POSITION=0.1
SURF5,SURF1
*TIE,NAME=TIE6,ADJUST=NO,POSITION=0.1
SURF1,SURF4
*TIE,NAME=TIE7,ADJUST=NO,POSITION=0.1
SURF6,SURF1
*RIGID BODY,ELSET=EALL,REF NODE=10000
*BOUNDARY
10000,1,5,0
**************************
*STEP,NLGEOM=YES
*STATIC
0.1,1.
*BOUNDARY
10000,6,6,0.1
*EL PRINT
S,
E
*NODE PRINT
U,
RF
*OUTPUT,FIELD
*ELEMENT OUTPUT
S,
E
*NODE OUTPUT
U,
RF
*END STEP