*HEADING
: NAFEMS TEST T3, 1-Dimensional Transient Heat Transfer  [CAX6MHT]
*PREPRINT,ECHO=YES,HISTORY=NO,MODEL=NO
*NODE,NSET=NALL
*NGEN,NSET=NALL
*ELEMENT,TYPE=CAX6MHT, ELSET=EALL
*ELGEN, ELSET=EALL
*MATERIAL,NAME=A1
*ELASTIC
 30.e6,0.0
*CONDUCTIVITY
35.0,
*DENSITY
7200.,
*SPECIFIC HEAT
440.5,
*BOUNDARY
  1,11,,0.
101,11,,0.
201,11,,0.
NALL,1,2
*SOLID SECTION,MATERIAL=A1, ELSET=EALL
*AMPLITUDE,NAME=SINE,DEFINITION=PERIODIC,VALUE=A
1,0.07854,0.0
0.0,100.0
*STEP,INC=100
*COUPLED TEMPERATURE-DISPLACEMENT
1.,32.,1.
*BOUNDARY,AMP=SINE
 41,11,,1.
141,11,,1.
241,11,,1.
*NODE PRINT,FREQ=32
NT,
COORD,
*NODE FILE,FREQ=32
NT,
COORD,
*EL PRINT,FREQ=0
*OUTPUT,HISTORY,FREQ=2
*NODE OUTPUT,NSET=NALL
NT,
*OUTPUT,FIELD,FREQ=32
*NODE OUTPUT,NSET=NALL
NT,
*END STEP