*HEADING
NAFEMS TEST T2, CRADIATE for 1-Dimensional Heat Transfer   [T2D2T]
*PREPRINT,ECHO=YES,HISTORY=NO,MODEL=NO
*NODE
*NGEN
*ELEMENT,TYPE=T2D2T, ELSET=EALL
*ELGEN,ELSET=ALL
*SOLID SECTION,MATERIAL=ELMAT, ELSET=ALL
3.14159E-4,
*PHYSICAL CONSTANTS,STEFAN BOLTZMANN=5.67E-8,ABSOLUTE ZERO=-273.16
*MATERIAL,NAME=ELMAT
*ELASTIC
1.0,0.0
*EXPANSION
0.0,
*CONDUCTIVITY
 55.6,
*SPECIFIC HEAT
 460.,
*DENSITY
 7850.,
*STEP
*COUPLED TEMPERATURE-DISPLACEMENT,STEADY STATE
*BOUNDARY
 1,1,2,0.0
 11,1,2,0.0
 1,11,,726.840
*CRADIATE
*EL PRINT,FREQUENCY=0
*NODE PRINT
 NT,
*END STEP