*HEADING
: NAFEMS TEST T3, 1-Dimensional Transient Heat Transfer  [DS4]
Fine Mesh
*RESTART,WRITE,FREQUENCY=2
*NODE
*NGEN, NSET=ODB_NSET
*ELEMENT,TYPE=DS4, ELSET=EALL
**2,201,1,103
**2,1,5,205
**4,5,205,103
*ELGEN,ELSET=ALLEL
**2,5,4,2
**3,5,4,4
**4,5,4,4
*MATERIAL,NAME=A1
*CONDUCTIVITY
35.0,
*DENSITY
7200.,
*SPECIFIC HEAT
440.5,
*BOUNDARY
1,11,15,0.
201,11,15,0.
*SHELL SECTION,MATERIAL=A1, ELSET=ALLEL
1.,
*AMPLITUDE,NAME=SINE,DEFINITION=PERIODIC,VALUE=A
1,0.07854,0.0
0.0,100.0
*STEP,INC=100
*HEAT TRANSFER,END=PERIOD
1.,32.,1.
*BOUNDARY,AMP=SINE
21,11,15,1.
221,11,15,1.
*NODE PRINT
NT,
COORD,
*NODE FILE,FREQ=32
NT,
COORD,
*EL PRINT,FREQ=0
*OUTPUT,FIELD,FREQ=32
*NODE OUTPUT
NT,
COORD,
*OUTPUT,HISTORY,FREQ=32
*NODE OUTPUT, NSET=ODB_NSET
NT,
COORD,
*END STEP