*HEADING
: NAFEMS TEST T2, 1-Dimensional Heat Transfer w/ Radiation  [DC2D4]
*NODE
*NGEN,NSET=ALL
*ELEMENT,TYPE=DC2D4, ELSET=EALL
*ELGEN,ELSET=ALLEL
*SOLID SECTION,MATERIAL=ELMAT, ELSET=ALLEL
*PHYSICAL CONSTANTS, ABSOLUTE ZERO=-273.16, STEFAN BOLTZMANN= 5.67E-8
*MATERIAL,NAME=ELMAT
*CONDUCTIVITY
 55.6,
*SPECIFIC HEAT
 460.,
*DENSITY
 7850.,
*STEP
*HEAT TRANSFER,STEADY STATE
*BOUNDARY
  1,11,,726.840
201,11,,726.840
*RADIATE
 10,R2,26.840,0.98
*EL PRINT,FREQUENCY=0
*NODE PRINT
 NT,
*NODE FILE
 NT,
*END STEP