*HEADING
: VERIFICATION OF NORMAL DEFINITIONS OF BEAMS AND SHELLS  [PIPE31]
*PREPRINT, MODEL=YES
*NODE
*NGEN,NSET=NVERT
*ELEMENT,TYPE=PIPE31
*ELGEN,ELSET=EVERT
*ELEMENT,TYPE=B31,ELSET=EHOR
*NSET, NSET=QA_TEST_NODEB
*BEAM SECTION, SECTION=PIPE, MATERIAL=A1, ELSET=EVERT
 0.5, .05
 0.0, 0.0, -1.0
*MATERIAL, NAME=A1
*DENSITY
 1.0
*ELASTIC
 30.0E6, 0.
*BEAM GENERAL SECTION, SECTION=GENERAL,ELSET=EHOR, DENSITY=1.0
 .25, 1.0E-6, 0.0, 1.0E-6, 0.010416667
 0.0, 0.0, -1.0
 30.0E6, 1.153846E7
*BOUNDARY
 1, 1,6
 7, 2
*AMPLITUDE, NAME=SMOOTH, DEFINITION=SMOOTH STEP
0.00, 0.0,
0.50, 1.0,
1.00, 1.0
*STEP
*DYNAMIC, EXPLICIT
 , 1.0
*CLOAD, AMPLITUDE=SMOOTH
 7,1, 25.0
*OUTPUT,FIELD
*NODE OUTPUT
 U
*OUTPUT, HISTORY
*NODE OUTPUT, NSET=QA_TEST_NODEB
 U
*OUTPUT,HISTORY,FREQUENCY=1
*ENERGY OUTPUT,VARIABLE=PRESELECT
*END STEP