*HEADING
*NODE
*NGEN
*NGEN,NSET=MID
*NGEN,NSET=TOP
*NFILL
MID,TOP,3,20
*NGEN,NSET=OUTER
*NGEN,NSET=TIP
*NFILL,SINGULAR=1
TIP,OUTER,8,1
*ELEMENT,TYPE=CPE8R
*ELGEN,ELSET=COLAPS
*SOLID SECTION,ELSET=ALL,MATERIAL=SPEC
1.,
*ELEMENT,TYPE=CPE8,ELSET=ALL
*ELGEN,ELSET=SPEC
*ELSET,ELSET=ALL
ALL,SPEC,COLAPS
*MATERIAL,NAME=SPEC
*ELASTIC
207000,0.3
*NSET,NSET=YFIX,GEN
*NSET,NSET=YFIX
YFIX,5009,10009
*BOUNDARY
YFIX,2,2
10009,1,1
*RESTART,W
*STEP
*STATIC
*CLOAD
122,2,1000
*CONTOUR INTEGRAL,CONTOURS=4,SYMM,OUTPUT=BOTH
TIP,1,0
*EL PRINT,FREQ=0
*NODE PRINT,FREQ=0
*ENDSTEP