*HEADING
NFL5XF8X
Axisymmetric Crack in bar
*NODE
*NGEN,NSET=TIP
*NGEN,NSET=OUTER
*NFILL,SINGULAR=1
TIP,OUTER,6,1
*NSET,NSET=MID,GEN
*NGEN,NSET=TOP
*NFILL
MID,TOP,4,500
*ELEMENT,TYPE=CAX8,ELSET=ALL
*ELGEN,ELSET=ALL
*MATERIAL,NAME=PLATE
*ELASTIC
207000,.3
*SOLID SECTION,ELSET=ALL,MATERIAL=PLATE
1,
*RESTART,W
*NSET,NSET=ZFIX,GEN
*NSET,NSET=RFIX,GEN
*ELSET,ELSET=PULL
*STEP
*STATIC
*BOUNDARY
ZFIX,2,2
RFIX,1,1
*DLOAD
PULL,P2,-100
*CONTOUR INTEGRAL,FREQ=1,CONTOURS=3,SYMM,OUTPUT=BOTH
TIP,-1,0
*ENDSTEP