*HEADING
: NAFEMS TEST LE9: AXISYMMETRIC BRANCHED SHELL - PRESSURE
FINE MESH, SAX2 ELEMENTS
GAUSS INTEGRATION WITH 3 INTEGRATION POINTS
*RESTART, W
*NODE
*NGEN
*NGEN
*NGEN
*NGEN,LINE=C
*NGEN,LINE=C
**
*MPC
TIE,33,137
**
*ELEMENT,TYPE=SAX2
*ELGEN,ELSET=CYBOT
*ELEMENT,TYPE=SAX2
*ELGEN,ELSET=CYTOP
*ELEMENT,TYPE=SAX2
*ELGEN,ELSET=SPH
*ELSET,ELSET=ALLE
CYBOT,CYTOP,SPH
*ELSET,ELSET=EOUT
*SHELL SECTION,ELSET=ALLE,MATERIAL=MAT, SECTION INTEGRATION=GAUSS
0.01,3
*MATERIAL,NAME=MAT
*ELASTIC
210.E9,0.3
**
*BOUNDARY
1,1,2
1,6
**
*STEP
*STATIC
*DLOAD
CYTOP,P,-1.E6
SPH,P,-1.E6
*NODE PRINT,F=0
*EL PRINT,POSITION=NODES,ELSET=EOUT
S,
SSAVG1,
SSAVG2,
SSAVG3,
SF1,
SF2,
SF3,
*EL FILE,POSITION=NODES,ELSET=EOUT
S,
SSAVG,
SF,
*ENDSTEP