*HEADING
: NAFEMS TEST FV52, [C3D10M] H.O.E. MESH
CONTINUUM Elements -- SIMPLY-SUPPORTED 'SOLID' SQUARE PLATE;
**
*NODE,NSET=BLOCK
**
**
*ELEMENT, TYPE=C3D10M, ELSET=SLAB
*NSET, NSET=EDGES
**
** slab
**
*SOLID SECTION, ELSET=SLAB, MATERIAL=MAT
*MATERIAL, NAME=MAT
*DENSITY
       8000.,
*ELASTIC, TYPE=ISO
      2.E+11,         0.3
*BOUNDARY
EDGES, 3,, 0.
*STEP, PERT
*FREQUENCY,EIGENSOLVER=LANCZOS, SIM=NO
10,,,-1.
*MODAL FILE
*OUTPUT,HISTORY,FREQUENCY=1
*MODAL OUTPUT
*NODE PRINT, F=0
*EL PRINT, F=0
*END STEP