*HEADING
NFV32I4F: NAFEMS TEST FV32, [CPS6]
Plane strain Elements -- Cantilevered tapered membrane;
*RESTART, WRITE
*NODE
*ELEMENT, TYPE=CPS6, ELSET=TRIANG
*SOLID SECTION, ELSET=TRIANG, MATERIAL=STEEL
*MATERIAL, NAME=STEEL
*DENSITY
8000.,
*ELASTIC
2.E+11,         0.3
*BOUNDARY
       1, 1,,          0.
       1, 2,,          0.
      34, 1,,          0.
      34, 2,,          0.
      67, 1,,          0.
      67, 2,,          0.
     100, 1,,          0.
     100, 2,,          0.
*STEP, PERT
*FREQUENCY, eigensolver=lanczos, SIM=NO
6, ,
*OUTPUT,FIELD,VAR=PRESELECT
*NODE PRINT, F=0
*EL PRINT, F=0
*END STEP