*HEADING
: NAFEMS TEST FV16, [S8R] TEST 4
Shell Elements -- Cantilevered thin square plate
*NODE
*NSET,NSET=LEFT,GEN
*ELEMENT,TYPE=S8R
*ELGEN,ELSET=SHELLS
*SHELL SECTION,ELSET=SHELLS,MATERIAL=MAT
0.05,
*MATERIAL,NAME=MAT
*ELASTIC
200.E9,0.3
*DENSITY
8000.,
*BOUNDARY
LEFT,1,3
LEFT,5
*STEP
*FREQUENCY, eigensolver=lanczos, SIM=NO
6, ,
*OUTPUT,FIELD,VAR=PRESELECT
*NODE PRINT,F=0
*EL PRINT,F=0
*ENDSTEP