*HEADING
  3DNLG-5: Element B33H
 LARGE DEFLECTION OF A CURVED ELASTIC CANTILEVER UNDER TRANSVERSE END LOAD
*RESTART,WRITE,OVERLAY
*NODE
*ELEMENT, TYPE=B33H , ELSET=PID1
*BEAM SECTION, ELSET=PID1, SECTION=RECT, MATERIAL=MID1
        1.,        1.,
          0.,          0.,          1.
*MATERIAL, NAME=MID1
*ELASTIC, TYPE=ISO
1.E7,0.0
*NSET,NSET=NODE12
*STEP, AMPLITUDE=RAMP, INC=1000, NLGEOM
*STATIC,DIRECT
         0.001 ,          1.,
*BOUNDARY, OP=NEW
       1, 1,6,          0.
*CLOAD, OP=NEW
      12, 3,       3000.
*EL PRINT, FREQ=0
*NODE PRINT, FREQ=1,NSET=NODE12
U1,U2,U3,CF3
*NODE FILE, FREQ=1,NSET=NODE12
U,
CF,
*OUTPUT,FIELD,FREQ=1
*NODE OUTPUT,NSET=NODE12
U,
CF,
*END STEP