** Mass scaling verification: Test of multiple TYPE=UNIFORM with
**                            *FIXED MASS SCALING
*HEADING
*RESTART,WRITE
*NODE,NSET=NALL
*NSET,NSET=RIGHT
*NSET,NSET=FIXED
*ELEMENT,TYPE=CPE4R,ELSET=NOSCALE1
*ELEMENT,TYPE=CPE4R,ELSET=NOSCALE2
*ELEMENT,TYPE=CPE4R,ELSET=NOSCALE3
*ELEMENT,TYPE=CPE4R,ELSET=NOSCALE4
*ELEMENT,TYPE=CPE4R,ELSET=SCALE1
*ELEMENT,TYPE=CPE4R,ELSET=SCALE2
*ELEMENT,TYPE=CPE4R,ELSET=SCALE3
*ELEMENT,TYPE=CPE4R,ELSET=SCALE4
*ELSET,ELSET=TEST1
SCALE1,SCALE2
*ELSET,ELSET=TEST2
SCALE3,SCALE4
*SOLID SECTION,ELSET=NOSCALE1,MATERIAL=NOSCALE1
.25,
*MATERIAL,NAME=NOSCALE1
*ELASTIC
1.E6, .25
*DENSITY
8.E-4,
*SOLID SECTION,ELSET=NOSCALE2,MATERIAL=NOSCALE2
.25,
*MATERIAL,NAME=NOSCALE2
*ELASTIC
1.E6, .25
*DENSITY
4.E-4,
*SOLID SECTION,ELSET=NOSCALE3,MATERIAL=NOSCALE3
.25,
*MATERIAL,NAME=NOSCALE3
*ELASTIC
1.E6, .25
*DENSITY
32.E-4,
*SOLID SECTION,ELSET=NOSCALE4,MATERIAL=NOSCALE4
.25,
*MATERIAL,NAME=NOSCALE4
*ELASTIC
1.E6, .25
*DENSITY
16.E-4,
*SOLID SECTION,ELSET=SCALE1,MATERIAL=SCALE1
.25,
*MATERIAL,NAME=SCALE1
*ELASTIC
1.E6, .25
*DENSITY
2.E-4,
*SOLID SECTION,ELSET=SCALE2,MATERIAL=SCALE2
.25,
*MATERIAL,NAME=SCALE2
*ELASTIC
1.E6, .25
*DENSITY
1.E-4,
*SOLID SECTION,ELSET=SCALE3,MATERIAL=SCALE3
.25,
*MATERIAL,NAME=SCALE3
*ELASTIC
1.E6, .25
*DENSITY
2.E-4,
*SOLID SECTION,ELSET=SCALE4,MATERIAL=SCALE4
.25,
*MATERIAL,NAME=SCALE4
*ELASTIC
1.E6, .25
*DENSITY
1.E-4,
*AMPLITUDE,NAME=SMOOTH,DEFINITION=SMOOTH STEP
0.,0., .00015, 1.
*NSET,NSET=QA_TEST_FIXED
FIXED,
**
*STEP
*DYNAMIC,EXPLICIT
,.00015
*FIXED MASS SCALING, TYPE=UNIFORM, DT=2.431713E-5, ELSET=TEST1
*FIXED MASS SCALING, TYPE=UNIFORM, DT=4.863425E-5, ELSET=TEST2
*BOUNDARY,AMP=SMOOTH
FIXED,1,2
RIGHT, 2
RIGHT, 1,1, .00075
*RESTART,WRITE,NUMBER INTERVAL= 20
*FILE OUTPUT,NUMBER INTERVAL=4,TIMEMARKS=YES
*NODE FILE, NSET=FIXED
RF,
***EL FILE
**EMSF, EDT
***OUTPUT,HISTORY,TIME INTERVAL=0.
***NODE OUTPUT,NSET=FIXED
**RF,
*OUTPUT, FIELD, NUMBER INTERVAL=4, TIMEMARKS=YES
*NODE OUTPUT, NSET=QA_TEST_FIXED
RF,
*OUTPUT,FIELD,VARIABLE=PRESELECT
*OUTPUT,HISTORY,VARIABLE=PRESELECT,TIMEINT=3.75E-05
*END STEP