*heading
MISES PLASTICITY WITH COMBINED ISOTROPIC-KINEMATIC HARDENING
WITH TEMPERATURE-DEPENDENT GAMMA PARAMETER
THERMOMECHANICAL LOADING:
 - Uniaxial tension (disp. control) test; direction 1, c3d8r;
 - Isothermal conditions for elements 1 and 2
 - Non-isothermal conditions for elements 3 and 4, with element 4
   undergoing abrupt temperature changes
*node,nset=alln1
*node,nset=alln2
*node,nset=alln3
*node,nset=alln4
*nset,nset=ndisp
*element,type=c3d8r,elset=alle
*solid section,elset=alle,material=alle
*material,name=alle
*density
7.82000E-09,
*elastic
200.e3,.3
*plastic, hardening=combined, data type=parameters
200., 2.222e4, 34.65, 0.0
200., 2.222e4, 44.65, 10.0
*cyclic hardening, parameters
*boundary
1,1,3
4,1,1
4,3,3
5,1,1
5,2,2
8,1,1
**
11,1,3
14,1,1
**
**
**
*initial conditions, type=temperature
alln1,0
alln2,10
alln3,0
alln4,0
*amplitude, name=ramp
0.0, 0.0, 2.0e-3, 1.0
*amplitude, name=step
0.0, 0.0, 1.0e-3, 0.0, 1.001e-3, 1.0, 2.0e-3, 1.0
**step 1 tension***
*step
*dynamic, explicit
 , 2.e-3
*boundary, type=velocity
ndisp, 1, 1, 100.0
*temperature, amplitude=ramp
alln3,10
*temperature, amplitude=step
alln4,10
*output, field
*element output
 s, alpha, pe, peeq, temp
*node output
 u
*output, history
*element output, elset=alle
 s11,alpha11,pe11,peeq,temp
*end step