*HEADING
  - COMPRESSIBLE HYPERELASTICITY (VAN DER WAALS), UNIAXIAL TENSION
*NODE,NSET=ALL
*ELEMENT,TYPE=CPS4R,ELSET=ONE
*NSET,NSET=SIDE1
*NSET,NSET=SIDE2
*NSET,NSET=SIDE3
*NSET,NSET=SIDE4
*SOLID SECTION,ELSET=ONE,MATERIAL=VANWAALS
*MATERIAL,NAME=VANWAALS
*HYPERELASTIC,VAN DER WAALS
200., 10., 0.1, 0., 0.001
*STEP,NLGEOM,INC=20
UNIAXIAL TENSION
*STATIC,DIRECT
1.,20.
*BOUNDARY,OP=NEW
SIDE4,1
SIDE1,2
SIDE2,1,1,5.
*EL PRINT,F=10
S,
E,
*NODE PRINT,F=10
U,RF
*EL FILE,F=10
S,E
*NODE FILE,F=10
U,RF
*END STEP