*HEADING
: RATE DEPENDENT POROUS PLASTICITY, UNIAXIAL TENSION TEST, C3D8
*NODE,NSET=ALLN
*ELEMENT,TYPE=C3D8,ELSET=ALLE
*SOLID SECTION,ELSET=ALLE,MATERIAL=ALLE
*MATERIAL,NAME=ALLE
*ELASTIC
200.E3,.3
*PLASTIC
200.,0.
220.,.0009
220.,.0029
*RATE DEPENDENT,TYPE=YIELD RATIO
*POROUS METAL PLASTICITY,RELATIVE DENSITY=0.95
**q1, q2, q3
*BOUNDARY
1,PINNED
2,2
5,2
6,2
4,1
5,1
8,1
2,3
3,3
*STEP,INC=20
*STATIC,DIRECT
1.E-3,20.E-3
*BOUNDARY
7,3,,.004
5,3,,.004
6,3,,.004
8,3,,.004
*EL PRINT
S,
SINV,
E,
PE,
EE,
VVF,
*NODE PRINT
U,RF
*OUTPUT,FIELD,FREQ=10
*ELEMENT OUTPUT
S,E,PE,VVF
*END STEP