*Heading
 Smoothed master surface
** Job name: CAE-SMOOTH Model name: Model-1
*Preprint, echo=NO, model=NO, history=NO, contact=NO
*RESTART,WRITE,FREQUENCY=50
** ----------------------------------------------------------------
**
** PART INSTANCE: DIE-1
**
*NODE, NSET=NREF
*Node,NSET=CONTACT
*Element, type=CAX4T,ELSET=CONTACT
*Nset, nset=DIE-1__PickedSet2, generate
*Elset, elset=DIE-1__PickedSet2, generate
** Section: CONTACT
*Solid Section, elset=DIE-1__PickedSet2, material=RIGID
*RIGID BODY, ELSET=DIE-1__PickedSet2, ISOTHERMAL=YES,
REF NODE=99999
** ----------------------------------------------------------------
**
** PART INSTANCE: METALBAR-1
**
*Node,NSET=ALL
*Element, type=CAX4T,ELSET=WORK
*Nset, nset=METALBAR-1__PickedSet2, generate
*Elset, elset=METALBAR-1__PickedSet2, generate
** Section: WORK
*Solid Section, elset=METALBAR-1__PickedSet2, material=METAL
*System
*Nset, nset=TOP, generate
*Elset, elset=TOP, generate
*Nset, nset=AXIS, generate
*Elset, elset=AXIS, generate
*Nset, nset=ALL, generate
*Elset, elset=ALL, generate
*Nset, nset=CONTACT, generate
*Elset, elset=CONTACT, generate
*Nset, nset=BOT, generate
*Elset, elset=BOT, generate
*Nset, nset=SIDE, generate
*Elset, elset=SIDE, generate
*Elset, elset=_DIE-SURF_S4
*Elset, elset=_DIE-SURF_S1, generate
*Elset, elset=_DIE-SURF_S2
*Elset, elset=_DIE-SURF_S3, generate
*Surface, type=ELEMENT, name=DIE-SURF
_DIE-SURF_S4, S4
_DIE-SURF_S1, S1
_DIE-SURF_S2, S2
_DIE-SURF_S3, S3
*Elset, elset=_METAL-SURF_S1, generate
*Elset, elset=_METAL-SURF_S2, generate
*Surface, type=ELEMENT, name=METAL-SURF
_METAL-SURF_S1, S1
_METAL-SURF_S2, S2
**
** MATERIALS
**
*Material, name=METAL
*Elastic
 6.9e+10, 0.33
*PLASTIC
** STRAIN RATE APPX .1 **
60.E6,0.0   ,20.
90.E6,.125  ,20.
113.E6,.25  ,20.
124.E6,.375 ,20.
133.E6,0.5  ,20.
165.E6,1.0  ,20.
166.E6,2.0  ,20.
60.E6,0.    ,50.
*SPECIFIC HEAT
880.,
*DENSITY
2700.,
*CONDUCTIVITY
204.,0.
225.,300.
*EXPANSION,ZERO=20.0
8.42E-5,
*INELASTIC HEAT FRACTION
*Material, name=RIGID
*Elastic
 1e+10, 0.3
*PLASTIC
** STRAIN RATE APPX .1 **
60.E6,0.0   ,20.
90.E6,.125  ,20.
113.E6,.25  ,20.
124.E6,.375 ,20.
133.E6,0.5  ,20.
165.E6,1.0  ,20.
166.E6,2.0  ,20.
60.E6,0.    ,50.
*SPECIFIC HEAT
880.,
*DENSITY
2700.,
*CONDUCTIVITY
204.,0.
225.,300.
*EXPANSION,ZERO=20.0
8.42E-5,
**
** INTERACTION PROPERTIES
**
*Surface Interaction, name=FRIC-INTER
*Friction
0.1,
*Gap Heat Generation
**
** INTERACTIONS
**
** Interaction: INTER
*Contact Pair, interaction=FRIC-INTER,TYPE=SURFACE
METAL-SURF, DIE-SURF
**
** INITIAL CONDITIONS
*INITIAL CONDITIONS,TYPE=TEMPERATURE
 ALL,20.
*STEP,AMPLITUDE=RAMP,NLGEOM, UNSYMM=YES
STABILIZE WORKPIECE INSIDE DIE
*COUPLED TEMPERATURE-DISPLACEMENT,DELTMX=100.
.1,1.
*BOUNDARY
NREF, 1, 2, 0.0
NREF, 6, 6, 0.0
NREF,11,11,20.0
AXIS,1,1,0.0
TOP,2,2,-.000125
ALL,11,11,20.0
*PRINT,CONTACT=YES
*OUTPUT,FIELD,VARIABLE=PRESELECT
*NODE OUTPUT,NSET=CONTACT
U
RF
NT
RFL
*ENERGY OUTPUT
*END STEP
**
*** step 2
**
*STEP,INC=800,AMPLITUDE=RAMP,NLGEOM, UNSYMM=YES
EXTRUSION
*COUPLED TEMPERATURE-DISPLACEMENT,DELTMX=100.
.1,10.
*BOUNDARY,OP=NEW
NREF, 1, 2, 0.0
NREF, 6, 6, 0.0
NREF, 11,11,20.0
AXIS,1,1,0.0
TOP,2,2,-.25
*PRINT,CONTACT=YES
*OUTPUT,FIELD,VARIABLE=PRESELECT
*NODE OUTPUT
 NT,
 U
RF
NT
RFL
*EL PRINT,ELSET=CONTACT,FREQUENCY=10
S
E
*ENERGY PRINT,FREQUENCY=1
*END STEP
**
*** step 3
**
*STEP,INC=200,AMPLITUDE=RAMP,NLGEOM, UNSYMM=YES
REMOVE CONTACT PAIRS
*COUPLED TEMPERATURE-DISPLACEMENT,DELTMX=100.
.1,.1,
*MODEL CHANGE,REMOVE, TYPE=CONTACT PAIR
 METAL-SURF,DIE-SURF
*RESTART,WRITE,FREQ=1
*PRINT,CONTACT=YES
*OUTPUT,FIELD,VARIABLE=PRESELECT
*NODE OUTPUT
U
RF
NT
RFL
*ENERGY PRINT,FREQUENCY=1
*END STEP
**
*** step 4
**
*STEP,INC=200,AMPLITUDE=RAMP,NLGEOM, UNSYMM=YES
LET WORKPIECE COOL DOWN
*COUPLED TEMPERATURE-DISPLACEMENT,DELTMX=100.
100.,10000.,
*FILM
BOT,F1,20.,10.
TOP,F3,20.,10.
SIDE,F2,20.,10.
*RESTART,WRITE,FREQ=1
*PRINT,CONTACT=YES
*OUTPUT,FIELD,VARIABLE=PRESELECT
*NODE OUTPUT
U
RF
NT
RFL
*ENERGY PRINT,FREQUENCY=1
*END STEP