*Heading
Meshed section: meshedsect_i_iso for use with
xbgs_meshedisect_iso_xpl and xbgs_meshedisect_iso_std
**
*preprint,model=yes
** PARTS
**
*Part, name=Part-1
*End Part
**
** ASSEMBLY
**
*Assembly, name=Assembly
**
*Instance, name=Part-1-1, part=Part-1
*Node
*Element, type=WARP2D3
*Element, type=WARP2D4
** Region: (IBeam:Picked)
*Elset, elset=_I1, internal, generate
** Section: IBeam
*Solid Section, elset=_I1, material=Steel
1.,
*End Instance
*End Assembly
**
** MATERIALS
**
*Material, name=Steel
*Elastic
 3e+07, 0.3
*Density
 7.3e-4
** ----------------------------------------------------------------
**
** STEP: Step-1
**
*Step, name=Step-1, perturbation
IBeam Section Generate
*Beam Section Generate
*Section Points
*Section Origin,Origin=Centroid
*End Step