*HEADING
DRUCKER-PRAGER/LINEAR ELASTICITY, CRITERION=HYP, UC, 3D, TEMP DEP
*RESTART,WRITE
*NODE,NSET=ALLN
*NODE,NSET=ALLN2
*ELEMENT,TYPE=C3D8R,ELSET=ONE
*ELEMENT,TYPE=C3D8R,ELSET=TWO
*ELSET, ELSET=ALLE
ONE,TWO
*SOLID SECTION,ELSET=ONE,MATERIAL=ONE
*MATERIAL,NAME=ONE
*DENSITY
1.0E-2
*ELASTIC
300.E3,.3
*DRUCKER PRAGER,SHEAR CRITERION=HYPERBOLIC
*DRUCKER PRAGER HARDENING
*SOLID SECTION,ELSET=TWO,MATERIAL=TWO
*MATERIAL,NAME=TWO
*DENSITY
1.0E-2
*ELASTIC
300.E3,.3
*DRUCKER PRAGER,SHEAR CRITERION=HYPERBOLIC,DEPENDENCIES=1
*DRUCKER PRAGER HARDENING
*INITIAL CONDITIONS,TYPE=TEMPERATURE
ALLN,20.
*INITIAL CONDITION,TYPE=FIELD,VARIABLE=1
ALLN2,20.
*BOUNDARY
1,PINNED
2,2
5,2
6,2
4,1
5,1
8,1
2,3
3,3
11,PINNED
*STEP
*DYNAMIC,EXPLICIT
 ,1.
*BOUNDARY,TYPE=VELOCITY
7,3,,-.2
5,3,,-.2
6,3,,-.2
8,3,,-.2
17,3,,-.2
15,3,,-.2
16,3,,-.2
18,3,,-.2
*OUTPUT,FIELD
*ELEMENT OUTPUT
S,E,PE,PEEQ
*NODE OUTPUT
U,RF
*OUTPUT,HISTORY,VARIABLE=PRESELECT
*ELEMENT OUTPUT,ELSET=ALLE
PEEQ,MISES,PRESS
*END STEP