*HEADING
DRUCKER-PRAGER/LINEAR ELASTICITY, CRITERION=HYP,SHEAR TEST, 3D
*NODE,NSET=ALLN
*ELEMENT,TYPE=C3D8,ELSET=ALLE
*SOLID SECTION,ELSET=ALLE,MATERIAL=ALLE
*MATERIAL,NAME=ALLE
*ELASTIC
300.E3,.3
*DRUCKER PRAGER,SHEAR CRITERION=HYPERBOLIC
*DRUCKER PRAGER HARDENING
*BOUNDARY
1,PINNED
2,PINNED
3,PINNED
4,PINNED
5,1
5,3
6,1
6,3
7,1
7,3
8,1
8,3
*STEP,INC=20
*STATIC,DIRECT
1.,20.
*BOUNDARY
7,2,,.5
5,2,,.5
6,2,,.5
8,2,,.5
*EL PRINT
S,
SINV,
E,
PE,
EE,
*NODE PRINT
U,
RF,
*OUTPUT,FIELD,FREQ=10
*ELEMENT OUTPUT
S,E,PE
*END STEP