*HEADING
MISES CREEP, LAW=STRAIN, UNIAXIAL TENSION RELAXATION, T3D2
*NODE,NSET=ALLN
*ELEMENT,TYPE=T3D2,ELSET=SPEC
*SOLID SECTION,ELSET=SPEC,MATERIAL=DATSTR
1.,
*MATERIAL,NAME=DATSTR
*ELASTIC
20.E6,.3
*CREEP,LAW=STRAIN
2.5E-27,5.,-0.2
*BOUNDARY
1,PINNED
*STEP
*STATIC
1.,1.
*BOUNDARY
2,1,,.01
*PRINT,FREQ=10,RESIDUAL=NO
*EL PRINT,FREQ=10
S,MISES
E,
CE,
*NODE PRINT,FREQ=10
U,RF
*OUTPUT,FIELD,FREQ=10
*ELEMENT OUTPUT
S,E,CE
*END STEP
*STEP,INC=100
*VISCO,CETOL=5E-6
.01,100000.,1.E-3
*END STEP