*HEADING
 THERMAL CONDUCTIVITY, FIELD VARIABLE DEPENDENCE TEST, DC1D2
*NODE,NSET=NALL
*NSET,NSET=FVNODS
*ELEMENT,ELSET=K1K3,TYPE=DC1D2
*ELEMENT,ELSET=K2FV,TYPE=DC1D2
*SOLID SECTION,ELSET=K1K3,MATERIAL=KCONST
3.,
*SOLID SECTION,ELSET=K2FV,MATERIAL=KFVDEP
3.,
*MATERIAL,NAME=KCONST
*CONDUCTIVITY
150.,
*MATERIAL,NAME=KFVDEP
*CONDUCTIVITY,DEP=1
1.,,25.
10.,,50.
100.,,75.
1000,,100.
*AMPLITUDE,NAME=RISE
0.,0.,1.,1.
*STEP,AMP=STEP
*HEAT TRANSFER,STEADY STATE
.25,1.,.25,.25
*BOUNDARY
1,11,,1000.
4,11,,0.
*FIELD,VARIABLE=1,AMP=RISE
FVNODS,100.
*EL PRINT
COORD,FV
*OUTPUT,FIELD
*ELEMENT OUTPUT
COORD,FV
*NODE PRINT
NT,
*OUTPUT,FIELD
*NODE OUTPUT
NT,
*END STEP