*heading
 HYPERELASTIC, MARLOW
 Uniaxial test, load control
*preprint, model=yes
*node,nset=all
*nset,nset=face11
*nset,nset=face12
*nset,nset=face13
*nset,nset=face14
*nset,nset=face15
*nset,nset=face16
*nset, nset=nload1
*element,type=c3d8r,elset=c3d
**
*node,nset=all
*nset,nset=face21
*nset,nset=face22
*nset,nset=face23
*nset,nset=face24
*nset, nset=nload2
*element,type=cpe4r,elset=cpe
**
*node,nset=all
*nset,nset=face31
*nset,nset=face32
*nset,nset=face33
*nset,nset=face34
*nset, nset=nload3
*element,type=cps4r,elset=cps
**
*node,nset=ntruss
*nset, nset=nload4
*nset, nset=nfix
*element,type=t3d2,elset=truss
**
*node,nset=all
*nset,nset=face51
*nset,nset=face52
*nset,nset=face53
*nset,nset=face54
*nset, nset=nload5
*element,type=m3d4r,elset=m3d
**
*node,nset=all
*nset,nset=face61
*nset,nset=face62
*nset,nset=face63
*nset,nset=face64
*nset, nset=nload6
*nset, nset=QA_TEST
*element,type=s4r,elset=s4r
**
*elset, elset=solid
 c3d, cpe, cps, truss
*elset, elset=eall
 solid, m3d, s4r
*elset, elset=QA_TEST
 eall,
**
*solid section,elset=c3d,material=hyper
 1.0,
*solid section,elset=cpe,material=hyper
 1.0,
*solid section,elset=cps,material=hyper
 1.0,
*solid section,elset=truss,material=hyper
 1.0,
*membrane section, elset=m3d, material=hyper
 1.0,
*shell section, elset=s4r, material=hyper
 1.0,
**
*material,name=hyper
*density
 10.,
*hyperelastic,marlow,poisson=0.475
*uniaxial test data, smooth
*equation
 face14,1,1,nload1,1,-1
 face22,1,1,nload2,1,-1
 face32,1,1,nload3,1,-1
 face52,1,1,nload5,1,-1
 face62,1,1,nload6,1,-1
*nset, nset=nload
 nload1, nload2, nload3, nload4, nload5, nload6
*boundary,type=velocity
 face11,3
 face13,2
 face16,1
**
 face21,2
 face24,1
**
 face31,2
 face34,1
**
 ntruss,2,3
 nfix,1
**
 face51,2
 face54,1
**
 face61,2
 face64,1
**
*amplitude, definition=smooth step, name=amp
 0.0, 0.0, 1.0, 1.0
**
*step
 uniaxial loading
*dynamic, explicit
 ,1.0
*cload, amplitude=amp
 nload,1,1.0e6
*output,field,number interval=10
*element output, elset=eall
 le,
*node out, nset=all
 u,
*output, field, number=2
*element output, elset=QA_TEST
 le,
*node output, nset=QA_TEST
 u,
*output, history, variable=preselect, time interval=.01
*element output, elset=eall
 s11, le11, le22, ne11, ne22, ener,
*end step