*HEADING
 Linear Kinematics Element Test - CAX4R
*NODE,NSET=NOUT
*NSET,NSET=QA_TEST
NOUT,
*ELEMENT,TYPE=CAX4R,ELSET=ALL
*SOLID SECTION, ELSET=ALL, MATERIAL=STEEL
1.0,
*MATERIAL, NAME=STEEL
*ELASTIC
1.0e05,0.3
*DENSITY
100.0,
** history data
*STEP, NLGEOM=NO
*DYNAMIC,EXPLICIT
,1.0
** apply boundary conditions
*BOUNDARY,TYPE=VELOCITY
** loading of element 1 (axial deformation)
**
1,1,1,-1.0
1,2,2,0.0
2,1,1,1.0
2,2,2,0.0
3,1,1,1.0
3,2,2,0.0
4,1,1,-1.0
4,2,2,0.0
** loading of element 2 (shearing deformation)
**
*BULK VISCOSITY
*RESTART,WRITE,NUMBER=1
*FILE OUTPUT,NUMBER=1
*NODE FILE
RF,
*EL FILE
ELEN,
S,
E,
***********************
*OUTPUT, FIELD, NUMBER INTER=1
*NODE OUTPUT,NSET=QA_TEST
U,
*OUTPUT,HISTORY,TIME INTERVAL=1.0
*ENERGY OUTPUT,VAR=PRESELECT
***********************
***OUTPUT,HISTORY,TIME INTERVAL=0.001
***NODE OUTPUT,NSET=NOUT
**U,
**RF,
***ENERGY OUTPUT
**ALLKE,ALLIE,ALLSE,ALLAE,ALLVD,ALLPD,ALLWK,ETOTAL,
**DT,
***ELEMENT OUTPUT,ELSET=ALL
**S,
**LE,
*END STEP