*HEADING
 RING BUCKLING ANALYSIS, C3D10, 4 X 20 MESH
*RESTART,WRITE
*NODE
*NGEN,NSET=INNER,LINE=C
*NGEN,NSET=OUTER,LINE=C
*NFILL,NSET=ALL1
INNER,OUTER,8,100
*NODE
*NGEN,LINE=C,NSET=INNER2
*NGEN,NSET=OUTER2,LINE=C
*NFILL,NSET=ALL2
INNER2,OUTER2,8,100
*NFILL,NSET=ALL
ALL1,ALL2,2,1000
*NSET,NSET=SYM,GENERATE
*NSET,NSET=VARY
*ELEMENT,TYPE=C3D10
*ELGEN,ELSET=EALL
*ELSET,GENERATE,ELSET=LOAD1
*ELSET,GENERATE,ELSET=LOAD2
*MATERIAL ,NAME= A1
*ELASTIC
30.0E6,0.0
*SOLID SECTION,MATERIAL=A1,ELSET=EALL
1.0,
*TRANSFORM, NSET=VARY
*BOUNDARY
ALL1,3
SYM,2
VARY,2
*STEP
*BUCKLE
1,
*DLOAD
LOAD1,P4,1.0
LOAD2,P3,1.0
*BOUNDARY,LOAD CASE=2, OP=NEW
ALL1,3
SYM,2
VARY,1
*NODE PRINT ,SUMMARY=NO
U,RF
*MODAL PRINT
*MODAL FILE
*OUTPUT,HISTORY,FREQUENCY=1
*MODAL OUTPUT
*END STEP