*HEADING
 D.E.N.  J - INTEGRAL  VIA 27 NODE BRICKS
*SYSTEM
*NODE
*NGEN,NSET=Z1
*NGEN,NSET=END1
*NGEN,NSET=END2
*NFILL,NSET=Z1
END1,END2,4,1
*NGEN,NSET=TIP1
*NGEN,NSET=OUTER1
*NFILL,SINGULAR=1,NSET=Z1
TIP1,OUTER1,6,1
*NGEN,NSET=Z2
*NGEN,NSET=END3
*NGEN,NSET=END4
*NFILL,NSET=Z2
END3,END4,4,1
*NGEN,NSET=TIP2
*NGEN,NSET=OUTER2
*NFILL,SINGULAR=1,NSET=Z2
TIP2,OUTER2,6,1
*NGEN,NSET=Z3
*NGEN,NSET=END5
*NGEN,NSET=END6
*NFILL,NSET=Z3
END5,END6,4,1
*NGEN,NSET=TIP3
*NGEN,NSET=OUTER3
*NFILL,SINGULAR=1,NSET=Z3
TIP3,OUTER3,6,1
*ELEMENT,TYPE=C3D27R
*ELGEN ,ELSET=ALL
*NSET,NSET=XAXIS,GENERATE
*NSET,NSET=YAXIS,GENERATE
*ELSET,ELSET=PULL
*NSET,NSET=SNAP ,GENERATE
*NSET,NSET=CRACKLE,GENERATE
*NSET,NSET=POP  ,GENERATE
*ELSET,ELSET=DRAW,GENERATE
*SOLID SECTION,MATERIAL=A1,ELSET=ALL
*MATERIAL,NAME=A1
*ELASTIC
30.E6, .3
*BOUNDARY
XAXIS,2
YAXIS,1
Z1,3
Z3,3
*STEP
*STATIC
*DLOAD
PULL, P4,-100.
*CONTOUR INTEGRAL,FREQUENCY=1,CONTOURS=3,SYMM,OUTPUT=BOTH,NORMAL
SNAP, CRACKLE, POP,
*CONTOUR INTEGRAL,FREQUENCY=1,CONTOURS=3,SYMM,OUTPUT=BOTH,NORMAL,TYPE=K FACTORS
SNAP, CRACKLE, POP,
*CONTOUR INTEGRAL,FREQUENCY=1,CONTOURS=3,SYMM,OUTPUT=BOTH,NORMAL,TYPE=T-STRESS
SNAP, CRACKLE, POP,
*ENERGY PRINT
*EL PRINT,FREQUENCY=0
*NODE PRINT
U,RF
*END STEP