*HEADING
 :  JAIN AND KENNEDY SLAB:  CPS4R
*NODE
*NGEN, NSET=YMIN
*NGEN, NSET=YMAX
*NSET,NSET=X-SYM, GEN
*NFILL, NSET=NALL
YMIN,YMAX,8, 100
*NSET,NSET=ROLLER
*NSET, NSET=VELOCITY
*ELEMENT,TYPE=CPS4R
*ELGEN,ELSET=SLAB
*ELSET,ELSET=MID, GEN
*ELSET, ELSET=SLAB1, GEN
*MATERIAL,NAME=A2
*ELASTIC
 29.E6,
*PLASTIC
 31900.,
*DENSITY
 7.3E-4,
*SOLID  SECTION,ELSET=SLAB,MATERIAL=A1
 18.,
*REBAR, ELEMENT=CONTINUUM, NAME=RE, MATERIAL=A2
SLAB1, 0.1944, 18., 0.0, 0.5066667 ,1
*MATERIAL,NAME=A1
*ELASTIC
 4.2E6, .18
*DENSITY
 2.246E-4,
*BRITTLE CRACKING
*BRITTLE SHEAR
*BOUNDARY
 X-SYM, XSYMM
 ROLLER, 2
*RESTART, WRITE, NUM=1
*AMPLITUDE, NAME=RAMP1
0.0, 0.0, 10.0E-2, 1.00
**
*STEP
*DYNAMIC, EXPLICIT
,0.1
*BOUNDARY, TYPE=VELOCITY, AMPLITUDE=RAMP1
 VELOCITY, 2, 2, -5.
*OUTPUT,FIELD,VAR=PRESELECT,NUMBER INTERVAL=5
**
** Output requests for qa testing
**
*NSET,NSET=QA_TEST
NALL,
*FILE OUTPUT,NUMBER=3,TIMEMARKS=YES
*NODE FILE
 U,
**
*OUTPUT,FIELD,TIMEMARKS=YES,NUMBER INTERVAL=3
*NODE OUTPUT,NSET=QA_TEST
U,
*OUTPUT,HISTORY,VAR=PRESELECT,TIME INTERVAL=0.025
**
*END STEP