*HEADING
 1D transient wave propagation, solid medium, incident wave load, spherical
 and defined through pressure amplitude
**
** Analytical solution to prescribed constant acceleration of a0 at x=0
**
** p(x,t) = (K a0 / c^2) (ct - x)  for x < ct
**        = 0  			   for x > ct
**
*PREPRINT,ECHO=NO,HISTORY=NO,MODEL=YES
*NODE, NSET=ODB_NSET
*NGEN,NSET=CHANNEL
*NSET,NSET=SAMPLE,GENERATE
*ELEMENT,TYPE=C3D10M
*ELGEN,ELSET=CHANNEL
**************************
*SURFACE,NAME=IW_LOAD
4,S1
1,S1
**************************
*SOLID SECTION,MATERIAL=SOLID,ELSET=CHANNEL
**
*MATERIAL,NAME=SOLID
*DENSITY
 1.E3,
*ELASTIC
 1.E6,0.0
**
**************************
*INCIDENT WAVE PROPERTY,NAME=IWPROP,TYPE=SPHERE
*INCIDENT WAVE FLUID PROPERTY
*AMPLITUDE,DEFINITION=TABULAR,NAME=PRESSUREVTIME
0.0,0.0,0.0015,-1.0
**************************
**
*BOUNDARY
CHANNEL,2,3
 11,1,1
 61,1,1
111,1,1
161,1,1
211,1,1
261,1,1
311,1,1
361,1,1
**************************
*RESTART,WRITE
**
*STEP,INC=1000,NLGEOM
*DYNAMIC,ALPHA=0.0
.0001,.0015
**
*INCIDENT WAVE,PRESSUREAMPLITUDE=PRESSUREVTIME,PROPERTY=IWPROP
IW_LOAD,415.09517
**
*EL PRINT,FREQ=5
 S,
*NODE PRINT,NSET=SAMPLE,FREQ=5
 U,
*OUTPUT,VAR=PRESELECT,FIELD,FREQ=1
*OUTPUT,VAR=PRESELECT,HISTORY,FREQ=1
*OUTPUT,FIELD,FREQUENCY=1
*NODE OUTPUT
 U
*ELEMENT OUTPUT
 S,
*OUTPUT,HISTORY,FREQUENCY=1
*NODE OUTPUT,NSET=SAMPLE
 U,
*ENDSTEP